{"text_format":"3","workbook":"xlsx","n_sheets":3,"sheets":["Sheet 1","Sheet 2","Sheet 3"],"not_rendered":{"images":1,"macros":1,"defined_names":7},"read":"whole","date_system":"1900"}

{"sheet":"Sheet 1","index":0,"n_rows":21,"n_cols":13,"rows_kept":21}
["Type your first name in the green box and press Enter --->",null,{"$f":"RANDBETWEEN(1, 3)","v":1}]
[]
[1,"What type of hypothesis test? ",null,{"$f":"IF(C3=\"paired t-test\", \" _____YAY!\", \"_____LOCKED\")","v":"_____LOCKED"},{"$f":" IF(OR(C3 = \"one sample t-test\", C3 = \"independent samples t-test\"), \"oops…try again!\", \" \")","v":" "},null,{"$f":" IF(OR(C3 = \"one sample t-test\", C3 = \"independent samples t-test\"), BeepMe(), \"\")","v":""},{"$nulls":3},{"$f":"IF(C3 = \"paired t-test\", SoundMe(),\"\")","v":""}]
[2,"What type of hypothesis test? ",null,{"$f":"IF(C4=\"one sample t-test\", \" _____YAY!\", \"_____LOCKED\")","v":"_____LOCKED"},{"$f":" IF(OR(C4 = \"paired t-test\", C4 = \"independent samples t-test\"), \"oops…try again!\", \" \")","v":" "},null,{"$f":" IF(OR(C4 = \"paired t-test\", C4 = \"independent samples t-test\"), BeepMe(), \"\")","v":""},{"$nulls":3},{"$f":"IF(C4 = \"one sample t-test\", SoundMe(),\"\")","v":""}]
[3,"What type of hypothesis test? ",null,{"$f":"IF(C5=\"independent samples t-test\", \" _____YAY!\", \"_____LOCKED\")","v":"_____LOCKED"},{"$f":" IF(OR(C5 = \"paired t-test\", C5 = \"one sample t-test\"), \"oops…try again!\", \" \")","v":" "},null,{"$f":" IF(OR(C5 = \"one sample t-test\", C5 = \"paired t-test\"), BeepMe(), \"\")","v":""},{"$nulls":3},{"$f":"IF(C5 = \"independent samples t-test\", SoundMe(),\"\")","v":""}]
[]
[]
[1,"The test statistic is (round to 2 decimal places):",null,{"$f":"IF(C8=3.14, \"Right Click\", \"LOCKED\")","v":"LOCKED"},{"$f":" IF(C8 = 3.14, \"\", IF( C8 = \"\", \"\", \"oops…try again!\"))","v":""},null,"WAIT UNTIL YOU GET EVERYTHING UNLOCKED",{"$nulls":3},{"$f":" IF(E8 = \"oops…try again!\", BeepMe(), \"\")","v":""},{"$f":"IF(D8 = \"Right Click\", SoundMe(),\"\")","v":""}]
[2,"The test statistic is (round to 2 decimal places):",null,{"$f":"IF(C9=0.35, \"on the Sheet\", \"LOCKED\")","v":"LOCKED"},{"$f":" IF(C9 = 0.35, \"\", IF( C9 = \"\", \"\", \"oops…try again!\"))","v":""},null,"AND SEE THE COMPLETE MESSAGE BEFORE YOU TRY",{"$nulls":3},{"$f":" IF(E9 = \"oops…try again!\", BeepMe(), \"\")","v":""},{"$f":"IF(D9 = \"on the Sheet\", SoundMe(),\"\")","v":""}]
[3,"The test statistic is (round to 2 decimal places):",null,{"$f":"IF(C10=-3.34, \"1 tab\", \"LOCKED\")","v":"LOCKED"},{"$f":" IF(C10 = -3.34, \"\", IF( C10 = \"\", \"\", \"oops…try again!\"))","v":""},null,"TO DO ANYTHING OR IT WON'T MAKE SENSE!",{"$nulls":3},{"$f":" IF(E10 = \"oops…try again!\", BeepMe(), \"\")","v":""},{"$f":"IF(D10 = \"1 tab\", SoundMe(),\"\")","v":""}]
[]
[]
[1,"The p-value is (round to 3 decimal places):",null,{"$f":"IF(C13=0.002, \"and Unhide\", \"LOCKED\")","v":"LOCKED"},{"$f":" IF(C13 = 0.002, \"\", IF( C13 = \"\", \"\", \"oops…try again!\"))","v":""},null,{"$f":" IF(E13 = \"oops…try again!\", BeepMe(), \"\")","v":""},{"$nulls":4},{"$f":"IF(D13 = \"and Unhide\", SoundMe(),\"\")","v":""}]
[2,"The p-value is (round to 3 decimal places):",null,{"$f":"IF(C14=0.366, \"Sheet\", \"LOCKED\")","v":"LOCKED"},{"$f":" IF(C14 = 0.366, \"\", IF( C14 = \"\", \"\", \"oops…try again!\"))","v":""},null,{"$f":" IF(E14 = \"oops…try again!\", BeepMe(), \"\")","v":""},{"$nulls":4},{"$f":"IF(D14 = \"Sheet\", SoundMe(),\"\")","v":""}]
[3,"The p-value is (round to 3 decimal places):",null,{"$f":"IF(C15=0.001, \"3 and go there\", \"LOCKED\")","v":"LOCKED"},{"$f":" IF(C15 = 0.001, \"\", IF( C15 = \"\", \"\", \"oops…try again!\"))","v":""},null,{"$f":" IF(E15 = \"oops…try again!\", BeepMe(), \"\")","v":""},{"$nulls":5},{"$f":"IF(D15 = \"3 and go there\", SoundMe(),\"\")","v":""}]
[]
[]
[1,"The decision is:",null,{"$f":"IF(C18=\"Reject Ho\", \" _____YAY!\", \"_____LOCKED\")","v":"_____LOCKED"},{"$f":" IF(C18 = \"Fail To Reject Ho\", \"oops…try again!\", \" \")","v":" "},null,{"$f":" IF(C18 = \"Fail To Reject Ho\", BeepMe(), \"\")","v":""},{"$nulls":3},{"$f":"IF(C18 = \"Reject Ho\", SoundMe(),\"\")","v":""}]
[2,"The decision is:",null,{"$f":"IF(C19=\"Fail To Reject Ho\", \" _____YAY!\", \"_____LOCKED\")","v":"_____LOCKED"},{"$f":" IF(C19 = \"Reject Ho\", \"oops…try again!\", \" \")","v":" "},null,{"$f":" IF(C19 = \"Reject Ho\", BeepMe(), \"\")","v":""},{"$nulls":3},{"$f":"IF(C19 = \"Fail To Reject Ho\", SoundMe(),\"\")","v":""}]
[3,"The decision is:",null,{"$f":"IF(C20=\"Reject Ho\", \" _____YAY!\", \"_____LOCKED\")","v":"_____LOCKED"},{"$f":" IF(C20 = \"Fail To Reject Ho\", \"oops…try again!\", \" \")","v":" "},null,{"$f":" IF(C20 = \"Fail To Reject Ho\", BeepMe(), \"\")","v":""}]
[{"$nulls":10},{"$f":"IF(C20 = \"Reject Ho\", SoundMe(),\"\")","v":""}]

{"sheet":"Sheet 2","index":1,"n_rows":40,"n_cols":4,"rows_kept":40}
["anxiety_pets","anxiety_no pets","before","after"]
[52,58,82,85]
[47,62,58,56]
[62,54,66,65]
[51,48,56,58]
[58,58,54,53]
[56,72,68,65]
[61,88,72,72]
[55,64,64,66]
[45,42,88,85]
[42,58,72,71]
[46,64,70,68]
[40,62,56,61]
[88,54,72,74]
[71,66,82,75]
[52,52,68,67]
[44,92,92,90]
[42,44,84,86]
[48,72,74,70]
[51,84,56,58]
[56,66,71,74]
[51,48,66,61]
[60,50,75,71]
[62,48,81,78]
[50,68,64,63]
[45,62,62,61]
[48,55,71,70]
[44,74,65,62]
[45,46,70,64]
[56,82,74,71]
[55,70,66,66]
[48,54,58,55]
[72,51,62,63]
[58,50,75,76]
[46,65,65,64]
[55,54,61,58]
[43,72,81,78]
[40,55,68,65]
[58,58,85,81]
[46,52,60,55]

{"sheet":"Sheet 3","index":2,"n_rows":38,"n_cols":17,"rows_kept":38,"hidden":true}
[]
[]
[]
[]
[]
[]
[{"$nulls":3},"FOR ","YOUR","NEXT","CLUE:"]
[{"$nulls":4},"PLAY ","SUDOKU!"]
[]
[{"$nulls":16},{"$f":"IF(X10=\"statistics\", \"Pick an animal\", \"\")","v":""}]
[{"$nulls":16},{"$f":"IF(Q10=\"Pick an animal\", \"that starts with\", \"\")","v":""}]
[{"$nulls":4},3,1,null,null,{"$f":"IF(D12=4, \"CELL\", \"LOCKED\")","v":"LOCKED"},null,null,{"$f":"IF(G12=2, \"X\", \"LOCKED\")","v":"LOCKED"},{"$nulls":4},{"$f":"IF(Q11=\"that starts with\", \"the first letter\", \"\")","v":""}]
[{"$nulls":3},1,null,null,3,null,null,{"$f":"IF(E13=2, \"10\", \"LOCKED\")","v":"LOCKED"},{"$f":"IF(F13=4, \"TYPE\", \"LOCKED\")","v":"LOCKED"},{"$nulls":5},{"$f":"IF(Q12=\"the first letter\", \"of your last name\", \"\")","v":""}]
[{"$nulls":3},2,null,null,4,null,null,{"$f":"IF(E14=1, \"IN\", \"LOCKED\")","v":"LOCKED"},{"$f":"IF(F14=3, \"THE\", \"LOCKED\")","v":"LOCKED"},{"$nulls":5},{"$f":"IF(Q13=\"of your last name\", \"and also include the number of\", \"\")","v":""}]
[{"$nulls":4},4,2,null,null,{"$f":"IF(D15=3, \"WORD\", \"LOCKED\")","v":"LOCKED"},null,null,{"$f":"IF(G15=1, \"statistics\", \"LOCKED\")","v":"LOCKED"},{"$nulls":4},{"$f":"IF(Q14=\"and also include the number of\", \"letters in your\", \"\")","v":""}]
[{"$nulls":16},{"$f":"IF(Q15=\"letters in your\", \"last name\", \"\")","v":""}]
[{"$nulls":16},{"$f":"IF(Q16=\"last name\", \"ex. baboon5\", \"\")","v":""}]
[{"$nulls":16},{"$f":"IF(Q17=\"ex. baboon5\", \"and encrypt\", \"\")","v":""}]
[{"$nulls":16},{"$f":"IF(Q18=\"and encrypt\", \"this name\", \"\")","v":""}]
[{"$nulls":16},{"$f":"IF(Q19=\"this name\", \"using the Enter Plain Text box of the\", \"\")","v":""}]
[{"$nulls":16},{"$f":"IF(Q20=\"using the Enter Plain Text box of the\", \"website below\", \"\")","v":""}]
[{"$nulls":16},{"$f":"IF(Q21=\"website below\", \"Include ONLY the\", \"\")","v":""}]
[{"$nulls":16},{"$f":"IF(Q22=\"Include ONLY the\", \"encrypted text\", \"\")","v":""}]
[{"$nulls":16},{"$f":"IF(Q23=\"encrypted text\", \"at the bottom of\", \"\")","v":""}]
[{"$nulls":16},{"$f":"IF(Q24=\"at the bottom of\", \"your discussion post\", \"\")","v":""}]
[{"$nulls":16},{"$f":"IF(Q25=\"your discussion post\", \"ex. X5cCOKcfbg==\", \"\")","v":""}]
[{"$nulls":16},{"$f":"IF(Q26=\"ex. X5cCOKcfbg==\", \"now click mouse in cell Q38 to get to website for your final escape!\", \"\")","v":""}]
{"$rows_empty":10}
[{"$nulls":16},"________"]